{"text_format":"1","workbook":"xlsx","n_sheets":11,"sheets":["sifarnik","Списак капиталних пројеката","списак","по изворима и контима ","K3","ipa-šifrarnik","Funkcije","korisnici","k4","izvori","projekti"],"not_rendered":{"charts":0,"images":0,"macros":1,"external_links":0,"defined_names":10,"comments":0,"pivot_tables":0},"unopened":[],"bounds":{"document_bytes":16777216,"sheet_cells":100000,"rows_first":2000,"rows_last":500,"rows_between":2000,"halvings":0,"cell_chars":16384,"cell_head_chars":4096},"cells_cut":0,"cells_raw":0,"read":"whole","date_system":"1900"}

{"sheet":"sifarnik","index":0,"n_rows":235,"n_cols":15,"rows_kept":235,"cut":false,"hidden":true,"merged":[]}
[null,null,null,1,"Приходи из буџета",null,null,null,null,null,null,null,null,1,"Органи и службе јединице локалне самоуправе"]
[null,null,null,"01","Приходи из буџета",null,null,null,null,null,null,null,null,2,"Предшколске установе "]
["januar",1,null,4,"Сопствени приходи буџетских корисника",null,null,null,null,null,null,null,null,3,"Установе културе"]
["februar",{"$f":"+B3+1","v":2},null,"04","Сопствени приходи буџетских корисника",null,null,null,null,null,null,null,null,4,"Остале установе из области јавних служби"]
["mart",3,null,"05-08","Донације и трансфери",null,null,null,null,null,null,null,null,5,"Јавна предузећа, дирекције и фондови основани од стране лок. власти који се финансирају из јавних прихода чија је намена утврђена посебним законом"]
["april",4,null,"09-12","Примања од продаје финансијске и нефинансијске имовине и задуживања",null,null,null,null,null,null,null,null,6,"Остали индиректни корисници буџета"]
["maj",5,null,"13-15","Нераспоређени вишак прихода и неутрошена средства из ранијих година",null,null,null,null,null,null,null,null,7,"Запослени који су примљени у радни однос због ступања на снагу закона којима су утврђене нове надлежности јединица локалне самоуправе "]
["jun",6]
["jul",7]
["avgust",8]
["septembar",9]
["oktobar",10]
["novembar",11]
["decembar",12]
["јануар_01",1]
["фебруар_02",{"$f":"+B15+1","v":2}]
["март_03",3]
["април_04",4]
["мај_05",5]
["јун_06",6]
{"$rows_left_out":216}
{"sheet":"Списак капиталних пројеката","index":1,"n_rows":35,"n_cols":14,"rows_kept":35,"cut":false,"hidden":false,"merged":[[34,9,34,11],[2,0,2,2],[0,0,0,13],[1,0,1,13],[3,2,3,8]]}
["Прилог  2"]
["Капитални пројекти у периоду 2016 - 2018. године"]
["Шифра СДК:"]
[null,null,{"$f":"IF(ISNA(+VLOOKUP(VALUE($A$4),sifarnik!$A$40:$B$196,2,FALSE))=TRUE,\"\",VLOOKUP(VALUE($A$4),sifarnik!$A$40:$B$196,2,FALSE))","v":""},null,null,null,null,null,null,null,null,null,null,0]
[]
[null,null,null,null,null,null,{"$f":"+SUM($G$11:$G$1168)","v":0},{"$f":"+SUM($H$11:$H$1168)","v":0},{"$f":"+SUM($I$11:$I$1168)","v":0},{"$f":"+SUM($J$11:$J$1168)","v":0},{"$f":"+SUM($K$11:$K$1168)","v":0},{"$f":"+SUM($L$11:$L$1168)","v":0},{"$f":"+SUM($L$11:$L$1168)","v":0},{"$f":"+SUM($N$11:$N$1168)","v":0}]
[]
[null,null,null,null,null,null,null,null,"                у дин (заокружено на 000)"]
["Приоритет",null,"Назив капиталног пројекта",null,"Година почетка финансирања пројекта","Година завршетка финансирања пројекта","Укупна вредност пројекта","Реализовано закључно са 31.12.2013. године","  2014","2015","2016"," 2017","2018","Након   2018"]
["1",null,"2",null,"3","4","5","6","7","9","10","11","12","13"]
[1,{"$f":"CONCATENATE($A$4,RIGHT(CONCATENATE(\"0\",$A11),2))","v":"01"},null,{"$f":"+VALUE(B11)","v":1}]
[{"$f":"A11+1","v":2},"02",null,2]
[3,"03",null,3]
[4,"04",null,4]
[5,"05",null,5]
[6,"06",null,6]
[7,"07",null,7]
[8,"08",null,8]
[9,"09",null,9]
[10,"10",null,10]
{"$rows_left_out":16}
{"sheet":"списак","index":2,"n_rows":67,"n_cols":15,"rows_kept":67,"cut":false,"hidden":false,"merged":[[0,0,0,14],[1,0,1,14],[2,0,2,3],[3,2,3,8]]}
["                                                                                                                                                                                                                Прилог 2"]
["                                                Преглед капиталних пројеката у периоду 2017-2019.године"]
["Шифра JЛС:"]
[66,null,"Мало Црниће"]
[]
[null,null,null,null,null,null,null,null,null,{"$f":"SUM(J11:J62)","v":0},{"$f":"SUM(K10:K61)","v":71680000},{"$f":"SUM(L11:L62)","v":107673840},{"$f":"SUM(M11:M62)","v":92200000},{"$f":"SUM(N11:N62)","v":92200000},{"$f":"SUM(O11:O62)","v":92200000}]
[{"$f":"27*'Списак капиталних пројеката'!A8","v":0},null,null,null,null,null,null,null,null,"                у дин (заокружено на 000)"]
["Приоритет",null,null,"Назив капиталног пројекта","Година почетка финансирања пројекта","Година завршетка финансирања пројекта","Укупна вредност пројекта","Уговорени рок завршетка      (месец-година)","Реализовано закључно са 31.12.2015.године","2016-план","2016-процена извршења","2017","2018","2019","Након   2019"]
[1,null,null,"2","3","4","5","6","7","8","9","10","11","12","13"]
[null,null,null,"namena","k-3","k-4","Opis k-3","Izvor","Opis k-4","budžet 2010","2011"]
[1,{"$f":"VLOOKUP(D11,'Списак капиталних пројеката'!$C$11:$D$30,2,FALSE)","v":{"$error":"#N/A"}},{"$f":"CONCATENATE(B11,RIGHT(CONCATENATE(\"0\",A11),2))","v":{"$error":"#N/A"}},"Завршетак изградње дома културе у Аљудову 3 фаза",null,null,null,null,null,null,1000000,1000000,1000000,1000000,1000000]
[2,{"$f":"VLOOKUP(D12,'Списак капиталних пројеката'!$C$11:$D$30,2,FALSE)","v":{"$error":"#N/A"}},{"$error":"#N/A"},"Реконструкција дома културе у Батуши 2 фаза",null,null,null,null,0,null,500000,1000000,1000000,1000000,1000000]
[3,{"$f":"VLOOKUP(D13,'Списак капиталних пројеката'!$C$11:$D$30,2,FALSE)","v":{"$error":"#N/A"}},{"$error":"#N/A"},"адаптација и санација дома културе у Божевцу 3фаза ",null,null,null,null,null,null,3500000,2500000,2500000,2500000,2500000]
[4,{"$f":"VLOOKUP(D14,'Списак капиталних пројеката'!$C$11:$D$30,2,FALSE)","v":{"$error":"#N/A"}},{"$error":"#N/A"},"Реконструкција дома културе у Великом Селу",null,null,null,null,null,null,500000,700000,700000,700000,700000]
[5,{"$f":"VLOOKUP(D15,'Списак капиталних пројеката'!$C$11:$D$30,2,FALSE)","v":{"$error":"#N/A"}},{"$error":"#N/A"},"Реконструкција Дома културе у Великом Црнићу 3 фаза",null,null,null,null,0,null,1000000,500000,500000,500000,500000]
[6,{"$f":"VLOOKUP(D16,'Списак капиталних пројеката'!$C$11:$D$30,2,FALSE)","v":{"$error":"#N/A"}},{"$error":"#N/A"},"Реконструкција дома културе у Врбници",null,null,null,null,0,null,500000,500000,500000,500000,500000]
[7,{"$f":"VLOOKUP(D17,'Списак капиталних пројеката'!$C$11:$D$30,2,FALSE)","v":{"$error":"#N/A"}},{"$error":"#N/A"},"Реконструкција дома културе у Забрези 3 фаза",null,null,null,null,null,null,500000,1000000,1000000,1000000,1000000]
[8,{"$f":"VLOOKUP(D18,'Списак капиталних пројеката'!$C$11:$D$30,2,FALSE)","v":{"$error":"#N/A"}},{"$error":"#N/A"},"Завршетак реконструкције дома културе у Калишту",null,null,null,null,0,null,500000,500000,500000,500000,500000]
[9,{"$f":"VLOOKUP(D19,'Списак капиталних пројеката'!$C$11:$D$30,2,FALSE)","v":{"$error":"#N/A"}},{"$error":"#N/A"},"Реконструкција домакултуре у Кобиљу",null,null,null,null,null,null,500000,1000000,1000000,1000000,1000000]
[10,null,null,"Завршетак радова на уређењу центра насеља у Кобиљу",null,null,null,null,null,null,2500000,500000,500000,500000,500000]
{"$rows_left_out":48}
{"sheet":"по изворима и контима ","index":3,"n_rows":66,"n_cols":23,"rows_kept":66,"cut":false,"hidden":false,"merged":[[0,0,0,23],[1,0,1,23],[2,0,2,3],[3,2,3,11]]}
["                                                                   Прилог  2a"]
["                                                Преглед  капиталних пројеката  у периоду 2017 - 2019. године"]
["Шифра ЈЛС:"]
[66,null,"Мало Црниће"]
[null,null,null,null,null,null,null,null,null,null,null,{"$f":"SUM(L10:L61)","v":71680000},{"$f":"SUM(M10:M61)","v":107673840},{"$f":"SUM(N10:N61)","v":92200000},{"$f":"SUM(O10:O61)","v":92200000},{"$f":"SUM(P10:P61)","v":92200000}]
[{"$f":"27*'Списак капиталних пројеката'!A8","v":0},null,null,null,null,null,null,null,null,null,null,null,"                у дин (заокружено на 000)"]
["Р.бр.",null,null,"Назив капиталног пројекта","Шифра програма","Шифра програмске активности/пројекта","Конто 3. ниво","Конто 4.ниво","Извор","Реализовано закључно са 31.12.2015. године","2016-план","2016-процена реализације","2017","2018","2019","након 2019","Грађевинска дозвола (датум издавања)","Уговор (датум правоснажности)","Уговорена вредност по основном уговору ( у дин.)","Додатно уговорена вредност (у дин.)","Рок реализације по основном уговору (датум)","Продужење рока реалзације (датум)","Напомена"]
[1,null,null,"2","3","4","5","6","7","8","9","10","11","12","13","14","15","16","17","18","19","20","21"]
[null,null,null,"namena",null,null,"k-3",null,"k-4","Opis k-3","Izvor","Opis k-4","budžet 2010","2011"]
[1,{"$f":"VLOOKUP(D10,'Списак капиталних пројеката'!$C$11:$D$30,2,FALSE)","v":{"$error":"#N/A"}},{"$f":"CONCATENATE(B10,RIGHT(CONCATENATE(\"0\",A10),2))","v":{"$error":"#N/A"}},"Завршетак изградње дома културе у Аљудову 3 фаза",1101,"1101-0001",511,5112,1,null,1000000,1000000,1000000,1000000,1000000,1000000]
[2,{"$f":"VLOOKUP(D11,'Списак капиталних пројеката'!$C$11:$D$30,2,FALSE)","v":{"$error":"#N/A"}},{"$error":"#N/A"},"Реконструкција дома културе у Батуши 2 фаза",1101,"1101-0001",511,5112,1,null,500000,500000,1000000,1000000,1000000,1000000]
[3,{"$f":"VLOOKUP(D12,'Списак капиталних пројеката'!$C$11:$D$30,2,FALSE)","v":{"$error":"#N/A"}},{"$error":"#N/A"},"адаптација и санација дома културе у Божевцу 3 фаза ",1101,"1101-0001",511,5112,1,null,3500000,3500000,2500000,2500000,2500000,2500000]
[4,{"$f":"VLOOKUP(D13,'Списак капиталних пројеката'!$C$11:$D$30,2,FALSE)","v":{"$error":"#N/A"}},{"$error":"#N/A"},"Реконструкција дома културе у Великом Селу",1101,"1101-0001",511,5112,1,null,500000,500000,700000,700000,700000,700000]
[5,{"$f":"VLOOKUP(D14,'Списак капиталних пројеката'!$C$11:$D$30,2,FALSE)","v":{"$error":"#N/A"}},{"$error":"#N/A"},"Реконструкција Дома културе у Великом Црнићу 3 фаза",1101,"1101-0001",511,5112,1,null,1000000,1000000,500000,500000,500000,500000]
[6,{"$f":"VLOOKUP(D15,'Списак капиталних пројеката'!$C$11:$D$30,2,FALSE)","v":{"$error":"#N/A"}},{"$error":"#N/A"},"Реконструкција дома културе у Врбници",1101,"1101-0001",511,5112,1,null,500000,500000,500000,500000,500000,500000]
[7,{"$f":"VLOOKUP(D16,'Списак капиталних пројеката'!$C$11:$D$30,2,FALSE)","v":{"$error":"#N/A"}},{"$error":"#N/A"},"Реконструкција дома културе у Забрези 3 фаза",1101,"1101-0001",511,5112,1,null,500000,500000,1000000,1000000,1000000,1000000]
[8,{"$f":"VLOOKUP(D17,'Списак капиталних пројеката'!$C$11:$D$30,2,FALSE)","v":{"$error":"#N/A"}},{"$error":"#N/A"},"Завршетак реконструкције дома културе у Калишту",1101,"1101-0001",511,5112,1,null,500000,500000,500000,500000,500000,500000]
[9,{"$f":"VLOOKUP(D18,'Списак капиталних пројеката'!$C$11:$D$30,2,FALSE)","v":{"$error":"#N/A"}},{"$error":"#N/A"},"Реконструкција домакултуре у Кобиљу",1101,"1101-0001",511,5112,1,null,500000,500000,1000000,1000000,1000000,1000000]
[10,{"$f":"VLOOKUP(D19,'Списак капиталних пројеката'!$C$11:$D$30,2,FALSE)","v":{"$error":"#N/A"}},{"$error":"#N/A"},"Завршетак радова на уређењу центра насеља у Кобиљу",1101,"1101-0001",511,5112,1,null,2500000,2500000,500000,500000,500000,500000]
[11,{"$f":"VLOOKUP(D20,'Списак капиталних пројеката'!$C$11:$D$30,2,FALSE)","v":{"$error":"#N/A"}},{"$error":"#N/A"},"Реконструкција дома културе у Малом Градишту-завршни радови",1101,"1101-0001",511,5112,1,null,500000,500000,500000,500000,500000,500000]
{"$rows_left_out":47}
{"sheet":"K3","index":4,"n_rows":104,"n_cols":11,"rows_kept":104,"cut":false,"hidden":true,"merged":[]}
[null,"Usklađeno sa oktobrom 2011",null,null,"jun 2010",null,null,null,"oktobar 2011"]
[]
[null,411,"Плате, додаци и накнаде запослених (зараде)",411,"ПЛАТЕ, ДОДАЦИ И НАКНАДЕ ЗАПОСЛЕНИХ (ЗАРАДЕ)",{"$f":"+IF(B3=D3,\"\",1)","v":""},{"$f":"+IF(C3=E3,\"\",1)","v":""},{"$f":"+B3-J3","v":0},{"$f":"+IF(C3=K3,0,111)","v":0},411,"ПЛАТЕ, ДОДАЦИ И НАКНАДЕ ЗАПОСЛЕНИХ (ЗАРАДЕ)"]
[null,412,"Социјални доприноси на терет послодавца",412,"СОЦИЈАЛНИ ДОПРИНОСИ НА ТЕРЕТ ПОСЛОДАВЦА","","",0,0,412,"СОЦИЈАЛНИ ДОПРИНОСИ НА ТЕРЕТ ПОСЛОДАВЦА"]
[null,413,"Накнаде у натури",413,"НАКНАДЕ У НАТУРИ","","",0,0,413,"НАКНАДЕ У НАТУРИ"]
[null,414,"Социјална давања запосленима",414,"СОЦИЈАЛНА ДАВАЊА ЗАПОСЛЕНИМА","","",0,0,414,"СОЦИЈАЛНА ДАВАЊА ЗАПОСЛЕНИМА"]
[null,415,"Накнаде трошкова за запослене",415,"НАКНАДЕ ТРОШКОВА ЗА ЗАПОСЛЕНЕ","","",0,0,415,"НАКНАДЕ ТРОШКОВА ЗА ЗАПОСЛЕНЕ"]
[null,416,"Награде запосленима и остали посебни расходи",416,"НАГРАДЕ ЗАПОСЛЕНИМА И  ОСТАЛИ ПОСЕБНИ РАСХОДИ","",1,0,0,416,"НАГРАДЕ ЗАПОСЛЕНИМА И ОСТАЛИ ПОСЕБНИ РАСХОДИ"]
[null,417,"Посланички додатак",417," ПОСЛАНИЧКИ ДОДАТАК","",1,0,0,417,"ПОСЛАНИЧКИ ДОДАТАК"]
[null,418,"Судијски додатак",418,"СУДИЈСКИ ДОДАТАК","","",0,0,418,"СУДИЈСКИ ДОДАТАК"]
[null,421,"Стални трошкови",421,"СТАЛНИ ТРОШКОВИ","","",0,0,421,"СТАЛНИ ТРОШКОВИ"]
[null,422,"Трошкови путовања",422,"ТРОШКОВИ ПУТОВАЊА","","",0,0,422,"ТРОШКОВИ ПУТОВАЊА"]
[null,423,"Услуге по уговору",423,"УСЛУГЕ ПО УГОВОРУ","","",0,0,423,"УСЛУГЕ ПО УГОВОРУ"]
[null,424,"Специјализоване услуге",424,"СПЕЦИЈАЛИЗОВАНЕ УСЛУГЕ","","",0,0,424,"СПЕЦИЈАЛИЗОВАНЕ УСЛУГЕ"]
[null,425,"Текуће поправке и одржавање",425,"ТЕКУЋЕ ПОПРАВКЕ И ОДРЖАВАЊЕ ","",1,0,0,425,"ТЕКУЋЕ ПОПРАВКЕ И ОДРЖАВАЊЕ"]
[null,426,"Материјал",426,"МАТЕРИЈАЛ","","",0,0,426,"МАТЕРИЈАЛ"]
[null,431,"Амортизација некретнина и опреме",431,"АМОРТИЗАЦИЈА НЕКРЕТНИНА И ОПРЕМЕ","","",0,0,431,"АМОРТИЗАЦИЈА НЕКРЕТНИНА И ОПРЕМЕ"]
[null,432,"Амортизација култивисане имовине",432,"АМОРТИЗАЦИЈА КУЛТИВИСАНЕ ИМОВИНЕ","","",0,0,432,"АМОРТИЗАЦИЈА КУЛТИВИСАНЕ ИМОВИНЕ"]
[null,433,"Употреба драгоцености",433,"УПОТРЕБА  ДРАГОЦЕНОСТИ","",1,0,0,433,"УПОТРЕБА ДРАГОЦЕНОСТИ"]
[null,434,"Употреба природне имовине",434,"УПОТРЕБА ПРИРОДНЕ ИМОВИНЕ","","",0,0,434,"УПОТРЕБА ПРИРОДНЕ ИМОВИНЕ"]
{"$rows_left_out":85}
{"sheet":"ipa-šifrarnik","index":5,"n_rows":109,"n_cols":8,"rows_kept":109,"cut":false,"hidden":true,"merged":[]}
[]
[]
["Count of naziv projekta"]
["PROG",null,null,"PROJ","naziv projekta","Total"]
["2602",null,"ДРУГА КОМПОНЕНТА ИНСТРУМЕНТА ЗА ПРЕТПРИСТУПНУ ПОМОЋ ЕУ - ПРЕКОГРАНИЧНА САРАДЊА","0701"," Прекогранична сарадња Мађарска-Србија 2007",1]
[null,"2602-07","ПРОГРАМИ ПРЕКОГРАНИЧНЕ САРАДЊЕ КОЈИ СЕ ФИНАНСИРАЈУ ИЗ ИПА 2007","0702"," Прекогранична сарадња Румунија-Србија 2007",1]
[null,"2602-08","ПРОГРАМИ ПРЕКОГРАНИЧНЕ САРАДЊЕ КОЈИ СЕ ФИНАНСИРАЈУ ИЗ ИПА 2008","0703"," Прекогранична сарадња Бугарска-Србија 2007",1]
[null,"2602-09","ПРОГРАМИ ПРЕКОГРАНИЧНЕ САРАДЊЕ КОЈИ СЕ ФИНАНСИРАЈУ ИЗ ИПА 2009","0704"," Јадрански  програм 2007",1]
[null,null,null,"0705"," Прекогранична сарадња Хрватска-Србија 2007",1]
[null,null,null,"0706"," Југоисточна Европа ЈИЕ 2007",1]
[null,null,null,"0707"," Прекогранична сарадња Србија-Босна и Херцеговина 2007",1]
[null,null,null,"0708"," Прекогранична сарадња Србија-Црна Гора 2007",1]
[null,null,null,"0801"," Прекогранична сарадња Мађарска-Србија 2008",1]
[null,null,null,"0802"," Прекогранична сарадња Румунија-Србија 2008",1]
[null,null,null,"0803"," Прекогранична сарадња Бугарска-Србија 2008",1]
[null,null,null,"0804"," Јадрански  програм 2008",1]
[null,null,null,"0805"," Прекогранична сарадња Хрватска-Србија 2008",1]
[null,null,null,"0806"," Југоисточна Европа ЈИЕ 2008",1]
[null,null,null,"0807"," Прекогранична сарадња Србија-Босна и Херцеговина 2008",1]
[null,null,null,"0808"," Прекогранична сарадња Србија-Црна Гора 2008",1]
{"$rows_left_out":90}
{"sheet":"Funkcije","index":6,"n_rows":138,"n_cols":2,"rows_kept":138,"cut":false,"hidden":true,"merged":[]}
["FUNKCIJA","NAZIV"]
["000","СОЦИЈАЛНА ЗАШТИТА"]
["010","Болест и инвалидност"]
["011","Болест"]
["012","Инвалидност"]
["020","Старост"]
["030","Породице преминулих"]
["040","Породица и деца"]
["050","Незапосленост"]
["060","Становање"]
["070","Социјална помоћ угроженом становништву некласификована на другом месту"]
["080","И&Р Социјална заштита"]
["090","Социјална заштита некласификована на другом месту"]
["100","ОПШТЕ ЈАВНЕ УСЛУГЕ"]
["110","Извршни и законодавни органи, финансијски и фискални послови и спољни послови"]
["111","Извршни и законодавни органи"]
["112","Финансијски и фискални послови и услуге"]
["113","Спољни послови"]
["120","Страна економска помоћ (давање)"]
["121","Економска помоћ земљама у развоју и земљама у транзицији"]
{"$rows_left_out":119}
{"sheet":"korisnici","index":7,"n_rows":178,"n_cols":3,"rows_kept":178,"cut":false,"hidden":true,"merged":[]}
["organizacija","naziv_organizacije  a2   b178","analiticar"]
[10100,"ПРЕДСЕДНИК РЕПУБЛИКЕ","Vera"]
[10200,"ГЕНЕРАЛНИ СЕКРЕТАРИЈАТ ВЛАДЕ","Ana"]
[10201,"КАНЦЕЛАРИЈА ЗА САРАДЊУ С МЕДИЈИМА","Ana"]
[10202,"ЦЕНТАР ЗА РАЗМИНИРАЊЕ","Jelica"]
[10204,"КАБИНЕТ ПРЕДСЕДНИКА ВЛАДЕ","Ana"]
[10206,"СЛУЖБА ЗА УПРАВЉАЊЕ КАДРОВИМА","Ana"]
[10208,"КАНЦЕЛАРИЈА НАЦИОНАЛНОГ САВЕТА ЗА САРАДЊУ СА МЕЂУНАРОДНИМ ТРИБУНАЛОМ ЗА КРИВИЧНО ГОЊЕЊЕ ЛИЦА ОДГОВОРНИХ ЗА ТЕШКА КРШЕЊА МЕЂУНАРОДНОГ ХУМАНИТАРНОГ ПРАВА ПОЧИЊЕНА НА ТЕРИТОРИЈИ БИВШЕ ЈУГОСЛАВИЈЕ ОД 1991. ГОДИНЕ","Ana"]
[10215,"КАНЦЕЛАРИЈА ЗА ОДРЖИВИ РАЗВОЈ НЕДОВОЉНО РАЗВИЈЕНИХ ПОДРУЧЈА","Ana"]
[10220,"СЛУЖБА КООРДИНАЦИОНОГ ТЕЛА ВЛАДЕ РЕПУБЛИКЕ СРБИЈЕ ЗА ОПШТИНЕ ПРЕШЕВО, БУЈАНОВАЦ И МЕДВЕЂА","Ana"]
[10222,"КАНЦЕЛАРИЈА САВЕТА ЗА НАЦИОНАЛНУ БЕЗБЕДНОСТ И ЗАШТИТУ ТАЈНИХ ПОДАТАКА","Ana"]
[10223,"КАНЦЕЛАРИЈА ЗА САРАДЊУ СА ЦИВИЛНИМ ДРУШТВОМ ","Ana"]
[10224,"КАНЦЕЛАРИЈА ЗА РЕГУЛAТОРНУ РЕФОРМУ И АНАЛИЗУ ЕФЕКАТА ПРОПИСА","Ana"]
[10225,"КАНЦЕЛАРИЈА ЗА РЕВИЗИЈУ СИСТЕМА УПРАВЉАЊА СРЕДСТВИМА ЕВРОПСКЕ УНИЈЕ","Ana"]
[10226,"КАНЦЕЛАРИЈА ЗА СТРУЧНЕ И ОПЕРАТИВНЕ ПОСЛОВЕ У ПРЕГОВАРАЧКОМ ПРОЦЕСУ","Ana"]
[10228,"КАНЦЕЛАРИЈА ЗА КОСОВО И МЕТОХИЈУ","Tanja"]
[10229,"КАНЦЕЛАРИЈА ЗА ЉУДСКА И МАЊИНСКА ПРАВА","Ana"]
[10230,"КАНЦЕЛАРИЈА ЗА САРАДЊУ С ДИЈАСПОРОМ И СРБИМА У РЕГИОНУ","Ana"]
[10231,"КАНЦЕЛАРИЈА ЗА САРАДЊУ С ЦРКВАМА И ВЕРСКИМ ЗАЈЕДНИЦАМА","Ana"]
[10232,"КАБИНЕТ ПРВОГ ПОТПРЕДСЕДНИКА ВЛАДЕ ЗАДУЖЕНОГ ЗА ОДБРАНУ, БЕЗБЕДНОСТ И БОРБУ ПРОТИВ КОРУПЦИЈЕ И КРИМИНАЛА И МИНИСТРА ОДБРАНЕ","Ana"]
{"$rows_left_out":159}
{"sheet":"k4","index":8,"n_rows":198,"n_cols":2,"rows_kept":198,"cut":false,"hidden":true,"merged":[]}
[4111,"Плате, додаци и накнаде запослених"]
[4121,"Допринос за пензијско и инвалидско осигурање"]
[4122,"Допринос за здравствено осигурање"]
[4123,"Допринос за незапосленост"]
[4131,"Накнаде у натури"]
[4141,"Исплата накнада за време одсуствовања с посла на терет фондова"]
[4142,"Расходи за образовање деце запослених"]
[4143,"Отпремнине и помоћи"]
[4144,"Помоћ у медицинском лечењу запосленог или чланова уже породице и друге помоћи запосленом"]
[4151,"Накнаде трошкова за запослене"]
[4161,"Награде запосленима и остали посебни расходи"]
[4171,"Посланички додатак"]
[4181,"Судијски додатак"]
[4211,"Трошкови платног промета и банкарских услуга"]
[4212,"Енергетске услуге"]
[4213,"Комуналне услуге"]
[4214,"Услуге комуникација"]
[4215,"Трошкови осигурања"]
[4216,"Закуп имовине и опреме"]
[4219,"Остали трошкови"]
{"$rows_left_out":179}
{"sheet":"izvori","index":9,"n_rows":15,"n_cols":2,"rows_kept":15,"cut":false,"hidden":true,"merged":[]}
["Извор","Опис"]
[1,"Приходи из буџета"]
[4,"Сопствени приходи буџетских корисника"]
[{"$f":"+A3+1","v":5},"Донације од иностраних земаља"]
[6,"Донације од међународних организација"]
[7,"Донације од осталих нивоа власти"]
[8,"Донације од невладиних организација и појединаца"]
[9,"Примања од продаје нефинансијске имовине"]
[10,"Примања од домаћих задуживања"]
[11,"Примања од иностраних задуживања"]
[12,"Примања од отплате датих кредита и продаје нефинансијске имовине"]
[13,"Нераспоређени вишак прихода из ранијих година"]
[14,"Неутрошена средства од приватизације из претходних година"]
[15,"Неутрошена средства од донација из претходних година"]
[16,"Родитељски динар за ваннаставне активности"]

{"sheet":"projekti","index":10,"n_rows":50,"n_cols":11,"rows_kept":50,"cut":false,"hidden":true,"merged":[]}
["kljuc","Шифра","Функција","Назив капиталног пројекта"," 2013"," 2014","  2015","proj","Назив органа",0,1000]
[{"$f":"CONCATENATE(B2,C2)","v":"10300330"},10300,330,"Основни суд у Краљеву – Санација и реконструкција објекта Основног суда у циљу отклањања последица  катастрофалног земљотреса ",60000000,37000000,0,{"$f":"CONCATENATE(A2,K2)","v":"103003301001"},"МИНИСТАРСТВО ПРАВДЕ И ДРЖАВНЕ УПРАВЕ",{"$f":"CONCATENATE(B2,C3,\"1001\")","v":"103003301001"},{"$f":"1000+ROW()-1","v":1001}]
["10300330",10300,330,"Прекршајни и Привредни суд у Шапцу - Решавање смештајног проблема (набавка, реконструкција и адаптација објекта) ",50000000,30000000,20000000,"103003301002","МИНИСТАРСТВО ПРАВДЕ И ДРЖАВНЕ УПРАВЕ",{"$f":"CONCATENATE(B3,C4,\"1001\")","v":"103003301001"},1002]
["10300330",10300,330,"Прекршајни суд у Београду (набавка, реконструкција и адаптација објекта) ",0,600000000,400000000,"103003301003","МИНИСТАРСТВО ПРАВДЕ И ДРЖАВНЕ УПРАВЕ",null,1003]
["10300330",10300,330," Надоградња/доградња и реконструкција зграде Основног суда у Лозници за потребе смештаја правосудних органа",40000000,10000000,0,"103003301004","МИНИСТАРСТВО ПРАВДЕ И ДРЖАВНЕ УПРАВЕ",null,1004]
["10300330",10300,330,"Прекршајни суд у Ужицу – Решавање смештајног проблема (набавка, реконструкција и адаптација објекта)",50000000,30000000,20000000,"103003301005","МИНИСТАРСТВО ПРАВДЕ И ДРЖАВНЕ УПРАВЕ",null,1005]
["10300330",10300,330,"Набавка, реконструкција и адаптација објекта за потребе смештаја одељења Првог основног суда у Београду (зграда „Аероинжењеринга”)",260000000,300000000,0,"103003301006","МИНИСТАРСТВО ПРАВДЕ И ДРЖАВНЕ УПРАВЕ",null,1006]
["10300330",10300,330,"Реконструкција и адаптација објекта „ПАЛАТА ПРАВДЕ” у Београду",0,1100000000,1400000000,"103003301007","МИНИСТАРСТВО ПРАВДЕ И ДРЖАВНЕ УПРАВЕ",null,1007]
["10300330",10300,330,"Реконструкција и адаптација објекта у ул. Катанићева бр. 15 у Београду (бивши Војнотехнички институт) за потребе правосудних органа",0,500000000,500000000,"103003301008","МИНИСТАРСТВО ПРАВДЕ И ДРЖАВНЕ УПРАВЕ",null,1008]
["10300330",10300,330,"Набавка, реконструкција и адаптација објекта за потребе смештаја Прекршајног и Привредног суда у Нишу ",100000000,100000000,100000000,"103003301009","МИНИСТАРСТВО ПРАВДЕ И ДРЖАВНЕ УПРАВЕ",null,1009]
["10300330",10300,330,"Основни суд у Бору -  (изградња новог или реконструкција адекватног постојећег простора) ",10000000,100000000,90000000,"103003301010","МИНИСТАРСТВО ПРАВДЕ И ДРЖАВНЕ УПРАВЕ",null,1010]
["10300330",10300,330,"Набавка неопходне опреме за функционисање правосудних органа ",100000000,200000000,200000000,"103003301011","МИНИСТАРСТВО ПРАВДЕ И ДРЖАВНЕ УПРАВЕ",null,1011]
["10500110",10500,110,"Експропријација земљишта у циљу изградње капиталних пројеката",3513993000,4312553000,4341535000,"105001101012","МИНИСТАРСТВО ФИНАНСИЈА И ПРИВРЕДЕ",null,1012]
["10500473",10500,473,"Изградња туристичке инфраструктуре и супраструктуре у туристичким центрима",215632000,2626409000,2867929000,"105004731013","МИНИСТАРСТВО ФИНАНСИЈА И ПРИВРЕДЕ",null,1013]
["10502110",10502,110,"Изградња граничног прелаза Гостун",84600000,157150000,155750000,"105021101014","УПРАВА ЦАРИНА",null,1014]
["10502110",10502,110,"Изградња граничног прелаза Бајмок",5200000,128750000,85800000,"105021101015","УПРАВА ЦАРИНА",null,1015]
["10502110",10502,110,"Изградња граничног прелаза Ватин",3400000,115875000,55800000,"105021101016","УПРАВА ЦАРИНА",null,1016]
["10502110",10502,110,"Изградња граничног прелаза Котроман",2200000,108426000,107600000,"105021101017","УПРАВА ЦАРИНА",null,1017]
["10502110",10502,110,"Изградња граничног прелаза Бајина Башта",22600000,50000000,30000000,"105021101018","УПРАВА ЦАРИНА",null,1018]
["10502110",10502,110,"Изградња нове царинске испоставе Београд",null,33000000,100000000,"105021101019","УПРАВА ЦАРИНА",null,1019]
{"$rows_left_out":30}